{"text_format":"1","workbook":"xlsx","n_sheets":7,"sheets":["入力手順","ローデータ⇒","①会場アンケート集計結果_食品ロス","集計結果⇒","②単純集計表 ","参照⇒","読み替え表_食品ロス"],"not_rendered":{"charts":5,"images":0,"macros":1,"external_links":0,"defined_names":2,"comments":0,"pivot_tables":0},"unopened":[],"bounds":{"document_bytes":16777216,"sheet_cells":100000,"rows_first":2000,"rows_last":500,"rows_between":2000,"halvings":0,"cell_chars":16384,"cell_head_chars":4096},"cells_cut":0,"cells_raw":0,"read":"whole","date_system":"1900"}

{"sheet":"入力手順","index":0,"n_rows":26,"n_cols":4,"rows_kept":26,"cut":false,"hidden":false,"merged":[[7,3,7,11],[15,3,15,11],[16,3,16,11],[8,3,8,11],[9,3,9,11],[10,3,10,11],[11,3,11,11],[13,3,13,11],[14,3,14,11],[12,3,12,11]]}
[]
[null,"会場アンケート入力ツール　シート構成・入力手順--------------------------------------------"]
[null,"◆食品ロス削減"]
[]
[null,"①「会場アンケート集計結果_食品ロス削減」シート【要入力】"]
[null,"・講演会・イベント等で回収されたアンケート調査票を入力する（データ化する）ツール"]
[null,"＜手順＞"]
[null,null,"①","「会場アンケート情報」の黄色セル欄に事業者番号、PDCAシート記載の事業番号、実施日、実施場所、アンケート配布状況を記入する"]
[null,null,"②","「表示」をクリックし、入力フォームを表示させる"]
[null,null,"③","「入力行」にアンケート結果の入力を開始する行番号を入力する（添付エクセルの場合は11行目から開始）"]
[null,null,"④","都道府県名、事業者名、アンケートを実施したイベント名、アンケート回収日付をそれぞれの欄に記入する"]
[null,null,"⑤"," 性別・年齢は入力フォームにしたがって選択する"]
[null,null,"⑥","「２．これまでの食品ロス削減実施状況について」は回答と一致するものを選択する"]
[null,null,"⑦","「３．今後の食品ロス削減実施意向について」は回答と一致するものを選択する"]
[null,null,"⑧","「4．実施意向の理由について」は回答と一致するものを選択する"]
[null,null,"⑨","「５．追跡アンケートへのご協力のお願い（メールアドレス）」では、アンケート下部を確認し、まずメールアドレスの有無を選択する。メールアドレスの記入があった場合は、メールアドレスを記入する"]
[null,null,"⑩","すべての入力が終わったら「【データ入力】」をクリック"]
[]
[]
[null,"②「単純集計表」シート"]
[null,"・「会場アンケート集計結果_食品ロス削減」シートに入力されたデータを簡易的に集計したものである"]
[null,"・来場者の性別・年代別構成比、現在の食品ロス削減実施状況、実施意向及び理由を把握可能"]
[]
[null,"③「読み替え表_食品ロス削減」シート"]
[null,"・本ファイルではアンケートの回答結果をデータ処理のため数字で代替している箇所がある"]
[null,"・その際のアンケート回答選択肢と数字の置換関係をまとめたシートである"]

{"sheet":"ローデータ⇒","index":1,"n_rows":0,"n_cols":0,"rows_kept":0,"cut":false,"hidden":false,"merged":[]}

{"sheet":"①会場アンケート集計結果_食品ロス","index":2,"n_rows":2011,"n_cols":38,"rows_kept":2011,"cut":false,"hidden":false,"merged":[[2,6,2,8],[7,11,7,12],[6,11,6,12],[6,13,6,20],[7,13,7,20],[6,21,6,23],[7,21,7,23],[7,7,7,8],[6,7,6,8],[6,9,6,10],[7,9,7,10]]}
[null,null,{"$f":"COLUMN()","v":3},{"$f":"COLUMN()","v":4},{"$f":"COLUMN()","v":5},{"$f":"COLUMN()","v":6},{"$f":"COLUMN()","v":7},{"$f":"COLUMN()","v":8},{"$f":"COLUMN()","v":9},{"$f":"COLUMN()","v":10},{"$f":"COLUMN()","v":11},{"$f":"COLUMN()","v":12},{"$f":"COLUMN()","v":13},{"$f":"COLUMN()","v":14},{"$f":"COLUMN()","v":15},{"$f":"COLUMN()","v":16},{"$f":"COLUMN()","v":17},{"$f":"COLUMN()","v":18},{"$f":"COLUMN()","v":19},{"$f":"COLUMN()","v":20},{"$f":"COLUMN()","v":21},{"$f":"COLUMN()","v":22},{"$f":"COLUMN()","v":23},{"$f":"COLUMN()","v":24},{"$f":"COLUMN()","v":25},{"$f":"COLUMN()","v":26},{"$f":"COLUMN()","v":27},{"$f":"COLUMN()","v":28},{"$f":"COLUMN()","v":29},{"$f":"COLUMN()","v":30},{"$f":"COLUMN()","v":31},{"$f":"COLUMN()","v":32},{"$f":"COLUMN()","v":33},{"$f":"COLUMN()","v":34},{"$f":"COLUMN()","v":35},null,{"$f":"COLUMN()","v":37},"*"]
[null,null,null,"【会場アンケート情報】"]
[null,null,null,"事業者番号","PDCAシート記載の事業番号","イベント名\n（PDCAシート記載の名称）","講演会・イベント　実施日",null,null,"実施場所","アンケート配布状況\n（どのタイミングでアンケートを実施したか）","アンケート\n回収数","ﾒｰﾙｱﾄﾞﾚｽ\n回収数"]
[null,null,null,null,null,{"$f":"$F$11&\"\"","v":""},"2021/XX/XX","～","2022/XX/XX",null,null,{"$f":"COUNTA($F$11:$F$2010)","v":0},{"$f":"COUNTIF($V$11:$V$2010,1)","v":0}]
[null,null,null,null,null,null,null,null,null,null,"↑プルダウンメニューから選択してください"]
[null,null,null,null,null,null,null,null,null,null,null,null,null,null,null,null,null,null,null,null,null,null,null,null,null,null,null,null,null,null,null,null,null,null,null,null,null,"*"]
[null,null,null,null,null,null,null,"１．あなたご自身について",null,"2．これまでの食品ロス削減のための取組の実施状況について",null,"３．今後の食品ロス削減のための取組の実施意向について",null,"４．実施意向の理由について",null,null,null,null,null,null,null,"５．追跡アンケートへのご協力のお願い（メールアドレス）",null,null,null,"作業用",null,"*"]
[null,null,null,"事業者情報",null,"イベント情報",null,"性別・年代",null,"現在の食品ロスを削減するための取組（食べ残しを減らす、食材を買いすぎない等）の実施状況についてお聞かせください。",null,"イベントに参加されて、食品ロスを削減するための取組を実施したいと思いましたか",null,"なぜ、食品ロスを削減するための取組を実施していますか/実施したいと思いましたか（3つまで）",null,null,null,null,null,null,null,"メールアドレス",null,null,null,null,null,"*"]
[null,null,"#","都道府県","事業者名","イベント名\n（PDCAシート記載の名称）","回収日付","性別","年代","#","回答","#","回答","CO2の削減に貢献する","もったいない","食費が安くなる","みんなが食品ロス削減に取り組んでいる","その他","その他（）","特に理由はない・なんとなく","未回答","記入\n有無","メールアドレス（@より前）","ドメイン","特定ID","Q4対象者","error"]
[null,null,null,null,null,null,null,null,null,null,null,null,null,1,2,3,4,5,null,6,99,null,null,null,null,null,null,"*"]
[null,null,{"$f":"ROW()-10","v":1},null,null,null,null,null,null,null,null,null,null,null,null,null,null,null,null,null,null,null,null,null,null,{"$f":"IF(OR(L11=1,L11=2,L11=3),1,0)","v":0},{"$f":"IFERROR(IF(J11=99,1,IF(MATCH(J11&\"/\"&L11,読み替え表_食品ロス!$P$29:$P$42,0),1,0)),0)","v":0},"*"]
[null,null,{"$f":"ROW()-10","v":2},null,null,null,null,null,null,null,null,null,null,null,null,null,null,null,null,null,null,null,null,null,null,{"$f":"IF(OR(L12=1,L12=2,L12=3),1,0)","v":0},{"$f":"IFERROR(IF(J12=99,1,IF(MATCH(J12&\"/\"&L12,読み替え表_食品ロス!$P$29:$P$42,0),1,0)),0)","v":0},"*"]
[null,null,{"$f":"ROW()-10","v":3},null,null,null,null,null,null,null,null,null,null,null,null,null,null,null,null,null,null,null,null,null,null,0,{"$f":"IFERROR(IF(J13=99,1,IF(MATCH(J13&\"/\"&L13,読み替え表_食品ロス!$P$29:$P$42,0),1,0)),0)","v":0},"*"]
[null,null,{"$f":"ROW()-10","v":4},null,null,null,null,null,null,null,null,null,null,null,null,null,null,null,null,null,null,null,null,null,null,0,{"$f":"IFERROR(IF(J14=99,1,IF(MATCH(J14&\"/\"&L14,読み替え表_食品ロス!$P$29:$P$42,0),1,0)),0)","v":0},"*"]
[null,null,5,null,null,null,null,null,null,null,null,null,null,null,null,null,null,null,null,null,null,null,null,null,null,0,{"$f":"IFERROR(IF(J15=99,1,IF(MATCH(J15&\"/\"&L15,読み替え表_食品ロス!$P$29:$P$42,0),1,0)),0)","v":0},"*"]
[null,null,6,null,null,null,null,null,null,null,null,null,null,null,null,null,null,null,null,null,null,null,null,null,null,0,{"$f":"IFERROR(IF(J16=99,1,IF(MATCH(J16&\"/\"&L16,読み替え表_食品ロス!$P$29:$P$42,0),1,0)),0)","v":0},"*"]
[null,null,7,null,null,null,null,null,null,null,null,null,null,null,null,null,null,null,null,null,null,null,null,null,null,0,{"$f":"IFERROR(IF(J17=99,1,IF(MATCH(J17&\"/\"&L17,読み替え表_食品ロス!$P$29:$P$42,0),1,0)),0)","v":0},"*"]
[null,null,8,null,null,null,null,null,null,null,null,null,null,null,null,null,null,null,null,null,null,null,null,null,null,0,{"$f":"IFERROR(IF(J18=99,1,IF(MATCH(J18&\"/\"&L18,読み替え表_食品ロス!$P$29:$P$42,0),1,0)),0)","v":0},"*"]
[null,null,9,null,null,null,null,null,null,null,null,null,null,null,null,null,null,null,null,null,null,null,null,null,null,0,{"$f":"IFERROR(IF(J19=99,1,IF(MATCH(J19&\"/\"&L19,読み替え表_食品ロス!$P$29:$P$42,0),1,0)),0)","v":0},"*"]
[null,null,10,null,null,null,null,null,null,null,null,null,null,null,null,null,null,null,null,null,null,null,null,null,null,0,{"$f":"IFERROR(IF(J20=99,1,IF(MATCH(J20&\"/\"&L20,読み替え表_食品ロス!$P$29:$P$42,0),1,0)),0)","v":0},"*"]
[null,null,11,null,null,null,null,null,null,null,null,null,null,null,null,null,null,null,null,null,null,null,null,null,null,0,{"$f":"IFERROR(IF(J21=99,1,IF(MATCH(J21&\"/\"&L21,読み替え表_食品ロス!$P$29:$P$42,0),1,0)),0)","v":0},"*"]
[null,null,12,null,null,null,null,null,null,null,null,null,null,null,null,null,null,null,null,null,null,null,null,null,null,0,{"$f":"IFERROR(IF(J22=99,1,IF(MATCH(J22&\"/\"&L22,読み替え表_食品ロス!$P$29:$P$42,0),1,0)),0)","v":0},"*"]
[null,null,13,null,null,null,null,null,null,null,null,null,null,null,null,null,null,null,null,null,null,null,null,null,null,0,{"$f":"IFERROR(IF(J23=99,1,IF(MATCH(J23&\"/\"&L23,読み替え表_食品ロス!$P$29:$P$42,0),1,0)),0)","v":0},"*"]
[null,null,14,null,null,null,null,null,null,null,null,null,null,null,null,null,null,null,null,null,null,null,null,null,null,0,{"$f":"IFERROR(IF(J24=99,1,IF(MATCH(J24&\"/\"&L24,読み替え表_食品ロス!$P$29:$P$42,0),1,0)),0)","v":0},"*"]
[null,null,15,null,null,null,null,null,null,null,null,null,null,null,null,null,null,null,null,null,null,null,null,null,null,0,{"$f":"IFERROR(IF(J25=99,1,IF(MATCH(J25&\"/\"&L25,読み替え表_食品ロス!$P$29:$P$42,0),1,0)),0)","v":0},"*"]
[null,null,16,null,null,null,null,null,null,null,null,null,null,null,null,null,null,null,null,null,null,null,null,null,null,0,{"$f":"IFERROR(IF(J26=99,1,IF(MATCH(J26&\"/\"&L26,読み替え表_食品ロス!$P$29:$P$42,0),1,0)),0)","v":0},"*"]
[null,null,17,null,null,null,null,null,null,null,null,null,null,null,null,null,null,null,null,null,null,null,null,null,null,0,{"$f":"IFERROR(IF(J27=99,1,IF(MATCH(J27&\"/\"&L27,読み替え表_食品ロス!$P$29:$P$42,0),1,0)),0)","v":0},"*"]
[null,null,18,null,null,null,null,null,null,null,null,null,null,null,null,null,null,null,null,null,null,null,null,null,null,0,{"$f":"IFERROR(IF(J28=99,1,IF(MATCH(J28&\"/\"&L28,読み替え表_食品ロス!$P$29:$P$42,0),1,0)),0)","v":0},"*"]
[null,null,19,null,null,null,null,null,null,null,null,null,null,null,null,null,null,null,null,null,null,null,null,null,null,0,{"$f":"IFERROR(IF(J29=99,1,IF(MATCH(J29&\"/\"&L29,読み替え表_食品ロス!$P$29:$P$42,0),1,0)),0)","v":0},"*"]
[null,null,20,null,null,null,null,null,null,null,null,null,null,null,null,null,null,null,null,null,null,null,null,null,null,0,{"$f":"IFERROR(IF(J30=99,1,IF(MATCH(J30&\"/\"&L30,読み替え表_食品ロス!$P$29:$P$42,0),1,0)),0)","v":0},"*"]
[null,null,21,null,null,null,null,null,null,null,null,null,null,null,null,null,null,null,null,null,null,null,null,null,null,0,{"$f":"IFERROR(IF(J31=99,1,IF(MATCH(J31&\"/\"&L31,読み替え表_食品ロス!$P$29:$P$42,0),1,0)),0)","v":0},"*"]
[null,null,22,null,null,null,null,null,null,null,null,null,null,null,null,null,null,null,null,null,null,null,null,null,null,0,{"$f":"IFERROR(IF(J32=99,1,IF(MATCH(J32&\"/\"&L32,読み替え表_食品ロス!$P$29:$P$42,0),1,0)),0)","v":0},"*"]
[null,null,23,null,null,null,null,null,null,null,null,null,null,null,null,null,null,null,null,null,null,null,null,null,null,0,{"$f":"IFERROR(IF(J33=99,1,IF(MATCH(J33&\"/\"&L33,読み替え表_食品ロス!$P$29:$P$42,0),1,0)),0)","v":0},"*"]
[null,null,24,null,null,null,null,null,null,null,null,null,null,null,null,null,null,null,null,null,null,null,null,null,null,0,{"$f":"IFERROR(IF(J34=99,1,IF(MATCH(J34&\"/\"&L34,読み替え表_食品ロス!$P$29:$P$42,0),1,0)),0)","v":0},"*"]
[null,null,25,null,null,null,null,null,null,null,null,null,null,null,null,null,null,null,null,null,null,null,null,null,null,0,{"$f":"IFERROR(IF(J35=99,1,IF(MATCH(J35&\"/\"&L35,読み替え表_食品ロス!$P$29:$P$42,0),1,0)),0)","v":0},"*"]
[null,null,26,null,null,null,null,null,null,null,null,null,null,null,null,null,null,null,null,null,null,null,null,null,null,0,{"$f":"IFERROR(IF(J36=99,1,IF(MATCH(J36&\"/\"&L36,読み替え表_食品ロス!$P$29:$P$42,0),1,0)),0)","v":0},"*"]
[null,null,27,null,null,null,null,null,null,null,null,null,null,null,null,null,null,null,null,null,null,null,null,null,null,0,{"$f":"IFERROR(IF(J37=99,1,IF(MATCH(J37&\"/\"&L37,読み替え表_食品ロス!$P$29:$P$42,0),1,0)),0)","v":0},"*"]
[null,null,28,null,null,null,null,null,null,null,null,null,null,null,null,null,null,null,null,null,null,null,null,null,null,0,{"$f":"IFERROR(IF(J38=99,1,IF(MATCH(J38&\"/\"&L38,読み替え表_食品ロス!$P$29:$P$42,0),1,0)),0)","v":0},"*"]
[null,null,29,null,null,null,null,null,null,null,null,null,null,null,null,null,null,null,null,null,null,null,null,null,null,0,{"$f":"IFERROR(IF(J39=99,1,IF(MATCH(J39&\"/\"&L39,読み替え表_食品ロス!$P$29:$P$42,0),1,0)),0)","v":0},"*"]
[null,null,30,null,null,null,null,null,null,null,null,null,null,null,null,null,null,null,null,null,null,null,null,null,null,0,{"$f":"IFERROR(IF(J40=99,1,IF(MATCH(J40&\"/\"&L40,読み替え表_食品ロス!$P$29:$P$42,0),1,0)),0)","v":0},"*"]
{"$rows_left_out":1972}
{"sheet":"集計結果⇒","index":3,"n_rows":0,"n_cols":0,"rows_kept":0,"cut":false,"hidden":false,"merged":[]}

{"sheet":"②単純集計表 ","index":4,"n_rows":166,"n_cols":12,"rows_kept":166,"cut":false,"hidden":false,"merged":[[134,4,134,6],[134,8,134,10],[133,1,134,2],[154,1,162,2],[140,4,140,6],[140,8,140,10],[6,1,6,2],[7,1,7,2],[29,4,29,5],[30,4,30,5],[31,4,31,5],[32,4,32,5],[27,1,44,1],[27,3,27,5],[35,3,35,5],[44,4,44,5],[40,4,40,5],[37,4,37,5],[38,4,38,5],[39,4,39,5],[43,4,43,5],[51,1,55,1],[105,1,111,1],[75,1,80,1],[1,3,1,5],[7,3,7,5],[6,3,6,5],[5,1,5,2],[5,3,5,5],[41,4,41,5],[42,4,42,5],[34,4,34,5],[36,4,36,5],[33,4,33,5],[1,1,1,2],[18,1,25,1],[4,1,4,2],[4,3,4,5],[3,3,3,5],[2,3,2,5],[28,4,28,5],[2,1,2,2],[3,1,3,2],[13,1,16,1],[128,1,128,5],[132,3,132,6],[132,7,132,10],[133,4,133,6],[133,8,133,10],[123,1,123,5],[124,1,124,5],[125,1,125,5],[126,1,126,5],[127,1,127,5],[142,4,142,6],[139,1,142,2],[139,4,139,6],[139,8,139,10],[141,4,141,6],[141,8,141,10],[142,8,142,10],[135,1,138,2],[135,4,135,6],[135,8,135,10],[136,4,136,6],[136,8,136,10],[137,4,137,6],[137,8,137,10],[138,4,138,6],[138,8,138,10],[143,1,148,2],[143,4,143,6],[143,8,143,10],[144,4,144,6],[144,8,144,10],[145,4,145,6],[145,8,145,10],[146,4,146,6],[146,8,146,10],[147,4,147,6],[147,8,147,10],[148,4,148,6],[148,8,148,10],[149,8,149,10],[150,4,150,6],[150,8,150,10],[149,1,153,2],[149,4,149,6],[152,4,152,6],[152,8,152,10],[153,4,153,6],[153,8,153,10],[151,4,151,6],[151,8,151,10],[157,4,157,6],[157,8,157,10],[154,4,154,6],[154,8,154,10],[160,8,160,10],[161,4,161,6],[161,8,161,10],[162,4,162,6],[162,8,162,10],[158,4,158,6],[158,8,158,10],[159,4,159,6],[159,8,159,10],[160,4,160,6],[155,4,155,6],[155,8,155,10],[156,4,156,6],[156,8,156,10]]}
[]
[null,"都道府県",null,{"$f":"①会場アンケート集計結果_食品ロス!D11","v":0}]
[null,"事業者名",null,{"$f":"①会場アンケート集計結果_食品ロス!E11","v":0}]
[null,"イベント名",null,{"$f":"①会場アンケート集計結果_食品ロス!F11","v":0}]
[null,"回収日付",null,{"$f":"①会場アンケート集計結果_食品ロス!G11","v":"00:00:00"}]
[null,"アンケート回収数",null,{"$f":"COUNTIFS(①会場アンケート集計結果_食品ロス!$H$11:$H$2010,\"<>\"&\"\")","v":0}]
[null,"有効アンケート数",null,{"$f":"COUNTIFS(①会場アンケート集計結果_食品ロス!$H$11:$H$2010,\"<>\"&\"\",①会場アンケート集計結果_食品ロス!$AA$11:$AA$2010,0)","v":0},{"$f":"COUNTIFS(①会場アンケート集計結果_食品ロス!$H$11:$H$2010,\"<>\"&\"\",①会場アンケート集計結果_食品ロス!$AA$11:$AA$2010,0)","v":0},{"$f":"COUNTIFS(①会場アンケート集計結果_食品ロス!$H$11:$H$2010,\"<>\"&\"\",①会場アンケート集計結果_食品ロス!$AA$11:$AA$2010,0)","v":0}]
[null,"メールアドレス回収数",null,{"$f":"COUNTIFS(①会場アンケート集計結果_食品ロス!$H$11:$H$2010,\"<>\"&\"\",①会場アンケート集計結果_食品ロス!$AA$11:$AA$2010,0,①会場アンケート集計結果_食品ロス!$V$11:$V$2010,1)","v":0}]
[]
[null,"【設問1-1】性別・年代"]
[null,"※来場者層の把握のため、「有効回答数」ではなく「アンケート回収数」で集計"]
[]
[null,null,null,null,null,null,"アンケート\n回収者","有効\n回答者","%","検算用"]
[null,"性別",1,"男性",null,null,{"$f":"COUNTIFS(①会場アンケート集計結果_食品ロス!$H:$H,'②単純集計表 '!D14)","v":0},{"$f":"COUNTIFS(①会場アンケート集計結果_食品ロス!$AA:$AA,0,①会場アンケート集計結果_食品ロス!$H:$H,'②単純集計表 '!D14)","v":0},{"$f":"G14/$D$6","v":{"$error":"#DIV/0!"}}]
[null,null,2,"女性",null,null,{"$f":"COUNTIFS(①会場アンケート集計結果_食品ロス!$H:$H,'②単純集計表 '!D15)","v":0},{"$f":"COUNTIFS(①会場アンケート集計結果_食品ロス!$AA:$AA,0,①会場アンケート集計結果_食品ロス!$H:$H,'②単純集計表 '!D15)","v":0},{"$f":"G15/$D$6","v":{"$error":"#DIV/0!"}}]
[null,null,3,"その他",null,null,{"$f":"COUNTIFS(①会場アンケート集計結果_食品ロス!$H:$H,'②単純集計表 '!D16)","v":0},{"$f":"COUNTIFS(①会場アンケート集計結果_食品ロス!$AA:$AA,0,①会場アンケート集計結果_食品ロス!$H:$H,'②単純集計表 '!D16)","v":0},{"$f":"G16/$D$6","v":{"$error":"#DIV/0!"}}]
[null,null,99,"未回答",null,null,{"$f":"COUNTIFS(①会場アンケート集計結果_食品ロス!$H:$H,'②単純集計表 '!D17)","v":0},{"$f":"COUNTIFS(①会場アンケート集計結果_食品ロス!$AA:$AA,0,①会場アンケート集計結果_食品ロス!$H:$H,'②単純集計表 '!D17)","v":0},{"$f":"G17/$D$6","v":{"$error":"#DIV/0!"}},{"$f":"SUM(G14:G17)","v":0}]
[]
[null,"年代",1,"10代",null,null,{"$f":"COUNTIFS(①会場アンケート集計結果_食品ロス!$I:$I,'②単純集計表 '!D19)","v":0},{"$f":"COUNTIFS(①会場アンケート集計結果_食品ロス!$AA:$AA,0,①会場アンケート集計結果_食品ロス!$I:$I,'②単純集計表 '!D19)","v":0},{"$f":"G19/$D$6","v":{"$error":"#DIV/0!"}}]
[null,null,2,"20代",null,null,{"$f":"COUNTIFS(①会場アンケート集計結果_食品ロス!$I:$I,'②単純集計表 '!D20)","v":0},{"$f":"COUNTIFS(①会場アンケート集計結果_食品ロス!$AA:$AA,0,①会場アンケート集計結果_食品ロス!$I:$I,'②単純集計表 '!D20)","v":0},{"$f":"G20/$D$6","v":{"$error":"#DIV/0!"}}]
[null,null,3,"30代",null,null,{"$f":"COUNTIFS(①会場アンケート集計結果_食品ロス!$I:$I,'②単純集計表 '!D21)","v":0},{"$f":"COUNTIFS(①会場アンケート集計結果_食品ロス!$AA:$AA,0,①会場アンケート集計結果_食品ロス!$I:$I,'②単純集計表 '!D21)","v":0},{"$error":"#DIV/0!"}]
[null,null,4,"40代",null,null,{"$f":"COUNTIFS(①会場アンケート集計結果_食品ロス!$I:$I,'②単純集計表 '!D22)","v":0},{"$f":"COUNTIFS(①会場アンケート集計結果_食品ロス!$AA:$AA,0,①会場アンケート集計結果_食品ロス!$I:$I,'②単純集計表 '!D22)","v":0},{"$error":"#DIV/0!"}]
[null,null,5,"50代",null,null,{"$f":"COUNTIFS(①会場アンケート集計結果_食品ロス!$I:$I,'②単純集計表 '!D23)","v":0},{"$f":"COUNTIFS(①会場アンケート集計結果_食品ロス!$AA:$AA,0,①会場アンケート集計結果_食品ロス!$I:$I,'②単純集計表 '!D23)","v":0},{"$error":"#DIV/0!"}]
[null,null,6,"60代",null,null,{"$f":"COUNTIFS(①会場アンケート集計結果_食品ロス!$I:$I,'②単純集計表 '!D24)","v":0},{"$f":"COUNTIFS(①会場アンケート集計結果_食品ロス!$AA:$AA,0,①会場アンケート集計結果_食品ロス!$I:$I,'②単純集計表 '!D24)","v":0},{"$error":"#DIV/0!"}]
[null,null,7,"70代以上",null,null,{"$f":"COUNTIFS(①会場アンケート集計結果_食品ロス!$I:$I,'②単純集計表 '!D25)","v":0},{"$f":"COUNTIFS(①会場アンケート集計結果_食品ロス!$AA:$AA,0,①会場アンケート集計結果_食品ロス!$I:$I,'②単純集計表 '!D25)","v":0},{"$error":"#DIV/0!"}]
[null,null,99,"未回答",null,null,{"$f":"COUNTIFS(①会場アンケート集計結果_食品ロス!$I:$I,'②単純集計表 '!D26)","v":0},{"$f":"COUNTIFS(①会場アンケート集計結果_食品ロス!$AA:$AA,0,①会場アンケート集計結果_食品ロス!$I:$I,'②単純集計表 '!D26)","v":0},{"$error":"#DIV/0!"},{"$f":"SUM(G19:G26)","v":0}]
[]
[null,"性別・年代別",null,"男性",null,null,{"$f":"SUM(G29:G35)","v":0},{"$f":"SUM(H29:H35)","v":0},{"$f":"G28/$D$6","v":{"$error":"#DIV/0!"}}]
[null,null,null,"男性","10代",null,{"$f":"COUNTIFS(①会場アンケート集計結果_食品ロス!$H:$H,D29,①会場アンケート集計結果_食品ロス!$I:$I,E29)","v":0},{"$f":"COUNTIFS(①会場アンケート集計結果_食品ロス!$AA:$AA,0,①会場アンケート集計結果_食品ロス!$H:$H,D29,①会場アンケート集計結果_食品ロス!$I:$I,E29)","v":0},{"$f":"G29/$D$6","v":{"$error":"#DIV/0!"}}]
[null,null,null,"男性","20代",null,{"$f":"COUNTIFS(①会場アンケート集計結果_食品ロス!$H:$H,D30,①会場アンケート集計結果_食品ロス!$I:$I,E30)","v":0},{"$f":"COUNTIFS(①会場アンケート集計結果_食品ロス!$AA:$AA,0,①会場アンケート集計結果_食品ロス!$H:$H,D30,①会場アンケート集計結果_食品ロス!$I:$I,E30)","v":0},{"$error":"#DIV/0!"}]
[null,null,null,"男性","30代",null,{"$f":"COUNTIFS(①会場アンケート集計結果_食品ロス!$H:$H,D31,①会場アンケート集計結果_食品ロス!$I:$I,E31)","v":0},{"$f":"COUNTIFS(①会場アンケート集計結果_食品ロス!$AA:$AA,0,①会場アンケート集計結果_食品ロス!$H:$H,D31,①会場アンケート集計結果_食品ロス!$I:$I,E31)","v":0},{"$error":"#DIV/0!"}]
[null,null,null,"男性","40代",null,{"$f":"COUNTIFS(①会場アンケート集計結果_食品ロス!$H:$H,D32,①会場アンケート集計結果_食品ロス!$I:$I,E32)","v":0},{"$f":"COUNTIFS(①会場アンケート集計結果_食品ロス!$AA:$AA,0,①会場アンケート集計結果_食品ロス!$H:$H,D32,①会場アンケート集計結果_食品ロス!$I:$I,E32)","v":0},{"$error":"#DIV/0!"}]
[null,null,null,"男性","50代",null,{"$f":"COUNTIFS(①会場アンケート集計結果_食品ロス!$H:$H,D33,①会場アンケート集計結果_食品ロス!$I:$I,E33)","v":0},{"$f":"COUNTIFS(①会場アンケート集計結果_食品ロス!$AA:$AA,0,①会場アンケート集計結果_食品ロス!$H:$H,D33,①会場アンケート集計結果_食品ロス!$I:$I,E33)","v":0},{"$error":"#DIV/0!"}]
[null,null,null,"男性","60代",null,{"$f":"COUNTIFS(①会場アンケート集計結果_食品ロス!$H:$H,D34,①会場アンケート集計結果_食品ロス!$I:$I,E34)","v":0},{"$f":"COUNTIFS(①会場アンケート集計結果_食品ロス!$AA:$AA,0,①会場アンケート集計結果_食品ロス!$H:$H,D34,①会場アンケート集計結果_食品ロス!$I:$I,E34)","v":0},{"$error":"#DIV/0!"}]
[null,null,null,"男性","70代以上",null,{"$f":"COUNTIFS(①会場アンケート集計結果_食品ロス!$H:$H,D35,①会場アンケート集計結果_食品ロス!$I:$I,E35)","v":0},{"$f":"COUNTIFS(①会場アンケート集計結果_食品ロス!$AA:$AA,0,①会場アンケート集計結果_食品ロス!$H:$H,D35,①会場アンケート集計結果_食品ロス!$I:$I,E35)","v":0},{"$error":"#DIV/0!"}]
[null,null,null,"女性",null,null,{"$f":"SUM(G37:G43)","v":0},{"$f":"SUM(H37:H43)","v":0},{"$error":"#DIV/0!"}]
[null,null,null,"女性","10代",null,{"$f":"COUNTIFS(①会場アンケート集計結果_食品ロス!$H:$H,D37,①会場アンケート集計結果_食品ロス!$I:$I,E37)","v":0},{"$f":"COUNTIFS(①会場アンケート集計結果_食品ロス!$AA:$AA,0,①会場アンケート集計結果_食品ロス!$H:$H,D37,①会場アンケート集計結果_食品ロス!$I:$I,E37)","v":0},{"$error":"#DIV/0!"}]
[null,null,null,"女性","20代",null,{"$f":"COUNTIFS(①会場アンケート集計結果_食品ロス!$H:$H,D38,①会場アンケート集計結果_食品ロス!$I:$I,E38)","v":0},{"$f":"COUNTIFS(①会場アンケート集計結果_食品ロス!$AA:$AA,0,①会場アンケート集計結果_食品ロス!$H:$H,D38,①会場アンケート集計結果_食品ロス!$I:$I,E38)","v":0},{"$error":"#DIV/0!"}]
[null,null,null,"女性","30代",null,{"$f":"COUNTIFS(①会場アンケート集計結果_食品ロス!$H:$H,D39,①会場アンケート集計結果_食品ロス!$I:$I,E39)","v":0},{"$f":"COUNTIFS(①会場アンケート集計結果_食品ロス!$AA:$AA,0,①会場アンケート集計結果_食品ロス!$H:$H,D39,①会場アンケート集計結果_食品ロス!$I:$I,E39)","v":0},{"$error":"#DIV/0!"}]
[null,null,null,"女性","40代",null,{"$f":"COUNTIFS(①会場アンケート集計結果_食品ロス!$H:$H,D40,①会場アンケート集計結果_食品ロス!$I:$I,E40)","v":0},{"$f":"COUNTIFS(①会場アンケート集計結果_食品ロス!$AA:$AA,0,①会場アンケート集計結果_食品ロス!$H:$H,D40,①会場アンケート集計結果_食品ロス!$I:$I,E40)","v":0},{"$error":"#DIV/0!"}]
{"$rows_left_out":127}
{"sheet":"参照⇒","index":5,"n_rows":0,"n_cols":0,"rows_kept":0,"cut":false,"hidden":false,"merged":[]}

{"sheet":"読み替え表_食品ロス","index":6,"n_rows":48,"n_cols":17,"rows_kept":48,"cut":false,"hidden":false,"merged":[[37,10,37,14],[33,10,33,14],[34,10,34,14],[35,10,35,14],[36,10,36,14],[38,10,38,14],[39,10,39,14],[40,4,40,7],[41,4,41,7],[40,10,40,14],[41,10,41,14],[39,4,39,7],[34,4,34,7],[35,4,35,7],[36,4,36,7],[37,4,37,7],[38,4,38,7],[33,4,33,7],[32,10,32,14],[32,4,32,7],[31,4,31,7],[30,4,30,7],[30,10,30,14],[31,10,31,14],[29,4,29,7],[28,4,28,7],[27,4,27,7],[27,10,27,14],[28,10,28,14],[29,10,29,14]]}
[]
[null,"・これまでの食品ロス取組取組状況について"]
[null,null,1,"常に行っている"]
[null,null,2,"気づいたときに行っている"]
[null,null,3,"行っていないが、行いたいと思っている"]
[null,null,4,"行っておらず、行いたいとも思わない"]
[null,null,99,"未回答"]
[]
[null,"・今後の食品ロス取組取組意向について"]
[null,null,1,"現在も常に行っており、今後も行いたい"]
[null,null,2,"これまで行う頻度は少なかったが、今後は常に行いたい"]
[null,null,3,"機会があれば行いたい"]
[null,null,4,"行いたいとは思わない"]
[null,null,5,"わからない"]
[null,null,99,"未回答"]
[]
[null,"・取組意向の理由について"]
[null,null,1,"CO2の削減に貢献するため"]
[null,null,2,"もったいないと思うため"]
[null,null,3,"これまでよりも食費が安くなると思ったため"]
[null,null,4,"みんな（周りの人）が食品ロス削減のための取組を行っているため"]
[null,null,5,"その他"]
[null,null,6,"特に理由はない・なんとなく"]
[null,null,99,"未回答"]
[]
[null,"・無効回答の定義：回答に矛盾があるため除外"]
[]
[null,null,null,"Q2の回答","普及啓発前（読替）",null,null,null,null,"Q3の回答","普及啓発後",null,null,null,null,"エラー参照用フラグ"]
[null,null,{"$f":"'②単純集計表 '!D150&\"/\"&'②単純集計表 '!H150","v":"1/2"},1,"常に行っている",null,null,null,"⇒",2,"これまで行う頻度は少なかったが、今後は常に行いたい",null,null,null,null,"1/2","※普及啓発前（アンケート回答時点）に「常に行っている」と回答しているにもかかわらず、普及啓発直後（アンケート回答時点）に常に行って「いない」と回答している"]
[null,null,{"$f":"'②単純集計表 '!D151&\"/\"&'②単純集計表 '!H151","v":"1/3"},1,"常に行っている",null,null,null,"⇒",3,"機会があれば行いたい",null,null,null,null,"1/3","※普及啓発前（アンケート回答時点）に「常に行っている」と回答しているにもかかわらず、普及啓発直後（アンケート回答時点）に常に行って「いない」と回答している"]
[null,null,{"$f":"'②単純集計表 '!D152&\"/\"&'②単純集計表 '!H152","v":"2/1"},2,"気づいたときに行っている",null,null,null,"⇒",1,"現在も常に行っており、今後も行いたい",null,null,null,null,"2/1","※普及啓発前（アンケート回答時点）に「常に行っている」と回答していないにもかかわらず、普及啓発直後（アンケート回答時点）に「常に行っている」と回答している"]
[null,null,{"$f":"'②単純集計表 '!D153&\"/\"&'②単純集計表 '!H153","v":"3/1"},3,"行っていないが、行いたいと思っている",null,null,null,"⇒",1,"現在も常に行っており、今後も行いたい",null,null,null,null,"3/1","※普及啓発前（アンケート回答時点）に「常に行っている」と回答していないにもかかわらず、普及啓発直後（アンケート回答時点）に「常に行っている」と回答している"]
[null,null,{"$f":"'②単純集計表 '!D154&\"/\"&'②単純集計表 '!H154","v":"4/1"},4,"行っておらず、行いたいとも思わない",null,null,null,"⇒",1,"現在も常に行っており、今後も行いたい",null,null,null,null,"4/1","※普及啓発前（アンケート回答時点）に「常に行っている」と回答していないにもかかわらず、普及啓発直後（アンケート回答時点）に「常に行っている」と回答している"]
[null,null,"99/1",99,"未回答",null,null,null,"⇒",1,"現在も常に行っており、今後も行いたい",null,null,null,null,"99/1","※一部設問が未回答であり、普及啓発効果が測定できないため"]
[null,null,"99/2",99,"未回答",null,null,null,"⇒",2,"これまで行う頻度は少なかったが、今後は常に行いたい",null,null,null,null,"99/2","※一部設問が未回答であり、普及啓発効果が測定できないため"]
[null,null,"99/3",99,"未回答",null,null,null,"⇒",3,"機会があれば行いたい",null,null,null,null,"99/3","※一部設問が未回答であり、普及啓発効果が測定できないため"]
[null,null,"99/4",99,"未回答",null,null,null,"⇒",4,"行いたいとは思わない",null,null,null,null,"99/4","※一部設問が未回答であり、普及啓発効果が測定できないため"]
[null,null,"99/5",99,"未回答",null,null,null,"⇒",5,"わからない",null,null,null,null,"99/5","※一部設問が未回答であり、普及啓発効果が測定できないため"]
[null,null,"99/99",99,"未回答",null,null,null,"⇒",99,"未回答",null,null,null,null,"99/99","※一部設問が未回答であり、普及啓発効果が測定できないため"]
[null,null,"2/99",2,"気づいたときに行っている",null,null,null,"⇒",99,"未回答",null,null,null,null,"2/99","※一部設問が未回答であり、普及啓発効果が測定できないため"]
{"$rows_left_out":8}